'# npm ERR! node-sass@6.0.1 postinstall: node scripts/build.js
一、背景与问题
在现代前端开发中,node-sass 是一个广泛使用的 CSS 预处理器工具,但其安装过程中常出现 npm ERR! node-sass@6.0.1 postinstall: node scripts/build.js 的错误。该错误通常发生在 postinstall 脚本执行阶段,核心原因是 scripts/build.js 脚本在尝试构建 native 模块时失败。
典型错误场景
npm ERR! node-sass@6.0.1 postinstall: node scripts/build.js
npm ERR! `node scripts/build.js` failed
npm ERR! node-sass@6.0.1 postinstall: node scripts/build.js
npm ERR! Exit status 1
npm ERR!
npm ERR! Failed at the node-sass@6.0.1 postinstall script.
npm ERR! This is probably not a problem with npm. There is likely
npm ERR! more logging output above.根本原因
- 依赖缺失:
node-sass需要系统级编译工具(如 Python、g++) - Node.js 版本不兼容:Node.js 16+ 对 native 模块支持有变化
- 脚本逻辑缺陷:
scripts/build.js在判断系统环境时存在逻辑漏洞
二、基本原理
1. postinstall 脚本机制
在 package.json 中定义的 postinstall 脚本会在 npm install 完成后自动执行。对于 node-sass,其 postinstall 脚本的核心作用是:
- 检测系统环境是否支持编译
- 下载或构建对应平台的 native 模块
- 将二进制文件写入
node_modules目录
2. node-sass 的构建流程
graph TD
A[启动 postinstall] --> B{是否支持编译?}
B -->|是| C[下载预编译二进制]
B -->|否| D[执行 build.js 编译]
D --> E[调用 node-gyp 编译]
E --> F[生成 native 模块]
F --> G[写入 node_modules]3. 系统依赖关系
| 依赖项 | 作用 | 缺失影响 |
|---|---|---|
| Python 2.x | 编译工具 | 编译失败 |
| g++/clang | C/C++ 编译器 | 编译失败 |
| make | 编译工具 | 编译失败 |
| node-gyp | Node.js 原生模块构建工具 | 无法编译 |
三、环境准备
1. 系统要求
- Linux/macOS:需安装 Python 2.x、g++、make
- Windows:需安装 Visual Studio 构建工具
2. 安装依赖
# Linux/macOS
sudo apt-get install -y python2 g++ make
# Windows
# 安装 Visual Studio 构建工具(含 C++ 依赖)3. Node.js 版本要求
# 推荐使用 Node.js 14.x
nvm install 14
nvm use 14四、核心实现
1. scripts/build.js 关键代码
// scripts/build.js
const { exec, execFileSync } = require('child_process');
const fs = require('fs');
const path = require('path');
function checkPython() {
try {
execFileSync('python', ['-c', 'print(1)'], { stdio: 'ignore' });
return true;
} catch (e) {
return false;
}
}
function buildNative() {
const python = checkPython() ? 'python2' : 'python';
const cmd = `node-gyp rebuild --python=${python}`;
try {
exec(cmd, { cwd: __dirname }, (err, stdout, stderr) => {
if (err) {
console.error(`Build failed: ${stderr}`);
process.exit(1);
}
console.log('Build succeeded');
});
} catch (e) {
console.error(`Build error: ${e.message}`);
process.exit(1);
}
}
buildNative();2. 代码解释
- 环境检测:
checkPython()函数检测 Python 2.x 是否可用 - 编译逻辑:
buildNative()函数调用node-gyp构建 native 模块 - 错误处理:通过
exec和execFileSync处理编译过程中的异常
3. 常见错误场景
# 缺少依赖时的错误
$ npm install
npm ERR! node-sass@6.0.1 postinstall: node scripts/build.js
npm ERR! `node scripts/build.js` failed
npm ERR! Exit status 1
npm ERR!
npm ERR! Failed at the node-sass@6.0.1 postinstall script.
npm ERR! This is probably not a problem with npm. There is likely
npm ERR! more logging output above.五、完整案例
1. 创建项目结构
mkdir node-sass-demo
cd node-sass-demo
npm init -y
npm install node-sass2. 完整项目结构
node-sass-demo/
├── package.json
├── node_modules/
│ └── node-sass/
│ └── scripts/
│ └── build.js
├── index.js
└── README.md3. index.js 示例
const sass = require('sass');
sass.render({
file: 'test.scss',
outFile: 'test.css'
}, (err) => {
if (err) {
console.error('Sass compilation error:', err);
} else {
console.log('Compilation successful');
}
});4. 运行示例
# 创建测试文件
echo "body { color: red; }" > test.scss
# 运行示例
node index.js六、源码解析
1. scripts/build.js 源码逐行解析
// 系统环境检测
const os = require('os');
const platform = os.platform();
// 判断是否为 Windows 系统
if (platform === 'win32') {
console.log('Windows platform detected');
} else {
console.log('Non-Windows platform detected');
}2. 编译命令构建
const cmd = `node-gyp rebuild --python=${python} --msvs_version=2019`;3. 错误日志处理
if (err) {
console.error(`Build failed: ${stderr}`);
process.exit(1);
}七、进阶使用
1. 自定义 postinstall 脚本
// package.json
{
"scripts": {
"postinstall": "node scripts/build.js && node scripts/postinstall.js"
}
}2. 使用替代方案
# 安装 dart-sass 替代方案
npm install sass3. 预编译二进制文件
# 下载预编译二进制文件
npm install node-sass --sass-binary-path=/path/to/sass八、性能与工程实践
1. 性能优化
- 使用
sass替代方案(无编译需求) - 预编译二进制文件
- 缓存编译结果
2. 安全风险
- 依赖项漏洞(如
node-sass的已知漏洞) - 原生模块潜在安全问题
3. 异常处理建议
try {
await sass.renderAsync({
file: 'test.scss'
});
} catch (err) {
console.error('Sass error:', err.message);
}九、常见问题与踩坑
1. 常见错误
| 错误类型 | 解决方案 |
|---|---|
| 缺少依赖 | 安装 Python 2.x、g++、make |
| Node.js 版本不兼容 | 使用 Node.js 14.x |
| Windows 路径问题 | 设置 npm config set scripts false |
| 编译超时 | 增加 --no-bin-links 参数 |
2. 错误示例
# 错误的解决方案
npm install --sass-binary-path=https://github.com/sass/sass/releases/download/1.40.0/sass3. 正确方案
# 正确的解决方案
npm install sass十、最佳实践
1. 推荐方案
- 优先使用
sass替代方案 - 在 CI/CD 中预编译二进制文件
- 使用
nvm管理 Node.js 版本
2. 实施建议
# 使用 sass 替代方案
npm install sass3. 环境配置建议
# 设置环境变量
export NODE_OPTIONS=--openssl-legacy-provider十一、总结
node-sass@6.0.1 postinstall: node scripts/build.js 错误是由于 native 模块编译失败引起的。通过深入分析其工作原理,我们发现该错误的根本原因在于系统环境配置不当。在实际开发中,建议优先使用 sass 替代方案,以避免编译相关的复杂性。对于必须使用 node-sass 的场景,应确保系统环境满足所有依赖要求,并合理配置 Node.js 版本。通过正确的环境配置和替代方案选择,可以有效避免此类问题,提高开发效率和项目稳定性。